{"text_format":"1","workbook":"xlsx","n_sheets":5,"sheets":["Ashburton EAC","Calculations","Lists","Instruments","Allocation Detail"],"not_rendered":{"charts":0,"images":1,"macros":1,"external_links":0,"defined_names":43,"comments":1,"pivot_tables":0},"unopened":[],"bounds":{"document_bytes":16777216,"sheet_cells":100000,"rows_first":2000,"rows_last":500,"rows_between":2000,"halvings":0,"cell_chars":16384,"cell_head_chars":4096},"cells_cut":0,"cells_raw":0,"read":"whole","date_system":"1900"}

{"sheet":"Ashburton EAC","index":0,"n_rows":127,"n_cols":587,"rows_kept":127,"cut":false,"hidden":false,"merged":[[19,0,19,1],[12,0,12,2],[14,0,14,2],[16,0,16,1],[17,0,17,1],[18,0,18,1],[40,0,40,1],[3,0,3,1],[29,0,29,3],[30,0,30,3],[31,0,31,3],[37,0,37,5],[32,0,32,3],[35,0,35,5],[10,0,10,1],[5,0,5,1],[6,0,6,1],[8,0,8,1],[11,0,11,1],[9,0,9,2],[7,0,7,2],[33,0,33,3],[41,0,41,1],[42,0,42,1],[43,0,43,1],[39,0,39,1],[3,2,3,4],[4,0,4,1],[21,0,21,3],[27,0,27,3],[28,0,28,3],[22,0,22,3],[23,0,23,3],[24,0,24,3],[25,0,25,3],[26,0,26,3],[13,0,13,1],[15,0,15,1]]}
[]
[null,null,"Ashburton Fund Managers",null,null,null,null,null,null,null,null,null,null,null,null,null,null,null,null,null,null,null,null,null,null,null,null,null,null,null,null,null,null,null,null,null,null,null,null,null,null,null,null,null,null,null,null,null,null,null,null,null,null,null,null,null,null,null,null,null,null,null,null,null,null,null,null,null,null,null,null,null,null,null,null,null,null,null,null,null,null,null,0,null,null,null,null,null,null,null,null,null,null,null,null,null,null,null,null,null,null,null,0,null,null,null,null,null,null,null,null,null,null,null,null,null,0,null,null,null,null,null,null,null,null,null,null,null,null,null,null,null,null,null,null,null,null,null,null,null,null,null,null,null,null,null,0,null,null,null,0,null,null,null,null,null,null,null,null,null,null,null,null,null,null,null,null,null,null,null,null,null,null,null,null,null,null,null,null,null,null,null,null,null,0,null,null,null,null,null,0,null,null,null,null,null,null,null,null,null,null,null,null,null,null,null,null,null,null,null,null,null,null,null,null,null,null,null,0,null,null,null,null,null,null,null,null,null,null,null,null,null,null,null,0,null,null,null,null,null,null,null,null,null,null,null,null,null,null,null,null,null,0,null,null,null,null,null,null,null,null,null,null,null,null,null,null,null,null,null,null,null,null,null,null,null,null,null,0,null,null,null,null,null,null,null,0,null,null,null,null,null,null,null,null,null,null,null,null,null,null,null,null,null,null,null,null,null,null,null,null,null,null,null,null,null,null,null,null,null,0,null,0,null,null,null,null,null,null,null,null,null,null,null,null,null,null,null,null,null,null,null,null,null,null,null,null,null,null,null,null,null,null,null,0,null,null,null,null,null,null,null,null,null,null,null,0,null,null,null,null,null,null,null,null,null,null,null,null,null,null,null,null,null,null,null,null,null,0,null,null,null,null,null,null,null,null,null,null,null,null,null,null,null,null,null,null,null,null,null,0,null,null,null,null,null,null,null,null,null,null,null,0,null,null,null,null,null,null,null,null,null,null,null,null,null,null,null,null,null,null,null,null,null,null,null,null,null,null,null,null,null,null,null,0,null,0,null,null,null,null,null,null,null,null,null,null,null,null,null,null,null,null,null,null,null,null,null,null,null,null,null,null,null,null,null,null,null,null,null,null,null,null,null,null,null,null,null,0,null,null,null,null,null,null,null,null,null,null,null,null,null,null,null,null,null,null,null,null,null,null,null,null,null,null,null,null,null,null,null,null,null,null,null,null,null,null,null,null,null,null,null,0,null,null,null,null,null,null,null,null,null,null,null,null,null,null,null,null,null,null,null,null,null,null,null,null,null,null,null,null,null,null,null,null,null,null,null,null,null,null,null,null,null,null,null,0]
[]
[null,null,null,null,null,null,null,null,null,null,null,null,null,null,null,null,null,null,null,null,null,null,null,null,null,null,null,null,null,null,null,null,null,null,null,null,null,null,null,null,null,null,null,null,null,null,null,null,null,null,null,null,null,null,null,null,null,null,null,null,null,null,null,null,null,null,null,null,null,null,null,null,null,null,null,null,null,null,null,null,null,null,0,null,null,null,null,null,null,null,null,null,null,null,null,null,null,null,null,null,null,null,null,null,null,null,null,null,null,null,null,null,null,null,null,null,0,null,null,null,null,null,null,null,null,null,null,null,null,null,null,null,null,null,null,null,null,null,null,null,null,null,null,null,null,null,null,null,null,null,0,null,null,null,null,null,null,null,null,null,null,null,null,null,null,null,null,null,null,null,null,null,null,null,null,null,null,null,null,null,null,null,null,null,0,null,null,null,null,null,null,null,null,null,null,null,null,null,null,null,null,null,null,null,null,null,null,null,null,null,null,null,null,null,null,null,null,null,0,null,null,null,null,null,null,null,null,null,null,null,null,null,null,null,null,null,null,null,null,null,null,null,null,null,null,null,null,null,null,null,null,null,0,null,null,null,null,null,null,null,null,null,null,null,null,null,null,null,null,null,null,null,null,null,null,null,null,null,null,null,null,null,null,null,null,null,0,null,null,null,null,null,null,null,null,null,null,null,null,null,null,null,null,null,null,null,null,null,null,null,null,null,null,null,null,null,null,null,null,null,0,null,null,null,null,null,null,null,null,null,null,null,null,null,null,null,null,null,null,null,null,null,null,null,null,null,null,null,null,null,null,null,null,null,0,null,null,null,null,null,null,null,null,null,null,null,null,null,null,null,null,null,null,null,null,null,null,null,null,null,null,null,null,null,null,null,null,null,0,null,null,null,null,null,null,null,null,null,null,null,null,null,null,null,null,null,null,null,null,null,null,null,null,null,null,null,null,null,null,null,null,null,0,null,null,null,null,null,null,null,null,null,null,null,null,null,null,null,null,null,null,null,null,null,null,null,null,null,null,null,null,null,null,null,null,null,0]
[]
["Lump sum investment"]
{"$rows_left_out":122}
{"sheet":"Calculations","index":1,"n_rows":127,"n_cols":112,"rows_kept":127,"cut":false,"hidden":true,"merged":[[0,14,0,16],[0,53,0,71],[0,73,0,90],[0,92,0,110],[0,24,0,30],[0,33,0,51]]}
[null,null,null,null,null,null,null,null,null,null,null,null,null,null,null,null,null,null,null,null,null,null,null,null,"Calculation Excluding Fees",null,null,null,null,null,null,null,null,"Advice fees - 10 years",null,null,null,null,null,null,null,null,null,null,null,null,null,null,null,null,null,null,null,"Advice fees - 5 years",null,null,null,null,null,null,null,null,null,null,null,null,null,null,null,null,null,null,null,"Advice fees - 3 years",null,null,null,null,null,null,null,null,null,null,null,null,null,null,null,null,null,null,"Advice fees - 1 years"]
[null,null,null,null,null,"Payment number","Month","Allocation then\nAsh U/T value at start of month","Ash U/T recurring value at start of month","Recurring investment (Ash u/t)","Ash u/t return on recurring","Return","ASH u/t annual fee","ASH recurring u/t annual fee","ASH u/t annual advice fee (Lump sum)","ASH u/t annual advice fee (Recurring)","Tot annual advice fee","Recurring value at end","Value before income","Income from ASH u/t","Income payment","Value at end",null,null,"Payment number","Month","Value at start of month","Recurring investment","Return","Income payment","Value at end",3.2661049652431538E-3,null,"Payment number","Month","Ash U/T value at start of month","Ash U/T recurring value at start of month","Tot value at start of month","Recurring investment (Ash u/t)","Ash u/t return","Ash u/t return","Return","ASH u/t annual fee","ASH recurring u/t annual fee","ASH u/t annual advice fee","ASH u/t annual advice fee","Tot annual advice fee","Recurring value at end","Value before income","Income from ASH u/t","Income payment","Value at end",4.2284820894709745E-3,"Payment number","Month","Ash U/T value at start of month","Ash U/T recurring value at start of month","Tot value at start of month","Recurring investment (Ash u/t)","Ash u/t return","Ash u/t return","Return","ASH u/t annual fee","ASH recurring u/t annual fee","ASH u/t annual advice fee","ASH u/t annual advice fee","Tot annual advice fee","Recurring value at end","Value before income","Income from ASH u/t","Income payment","Value at end",4.0822054915426037E-3,"Payment number","Month","Ash U/T value at start of month","Ash U/T recurring value at start of month","Tot value at start of month","Recurring investment (Ash u/t)","Ash u/t return","Ash u/t return","ASH u/t annual fee","ASH recurring u/t annual fee","ASH u/t annual advice fee","ASH u/t annual advice fee","Tot annual advice fee","Recurring value at end","Value before income","Income from ASH u/t","Income payment","Value at end",3.88809237169344E-3,"Payment number","Month","Ash U/T value at start of month","Ash U/T recurring value at start of month","Tot value at start of month","Recurring investment (Ash u/t)","Ash u/t return","Ash u/t return","Return","ASH u/t annual fee","ASH recurring u/t annual fee","ASH u/t annual advice fee","ASH u/t annual advice fee","Tot annual advice fee","Recurring value at end","Value before income","Income from ASH u/t","Income payment","Value at end",2.9198560510362973E-3]
[null,null,null,{"$f":"(1+B45)^(1/12)-1","v":4.8675505653430484E-3},null,1,0,{"$f":"'Allocation Detail'!D13","v":0},0,{"$f":"IF(G3/$D$16-INT(G3/$D$16)=0,ROUND($D$19*$D$20*((1+$D$17)^INT(G3/12)),2),0)","v":0},{"$f":"ROUND(J3*((1+$B$45)^(1/12)-1),2)","v":0},{"$f":"ROUND(H3*((1+$B$45)^(1/12)-1),2)","v":0},{"$f":"IFERROR(ROUND(-SUM(H3,L3)*'Allocation Detail'!$E$13/12,2),0)","v":0},{"$f":"IFERROR(ROUND(-SUM(J3,K3)*'Allocation Detail'!$E$13/12,2),0)","v":0},{"$f":"ROUND(-(H3+L3)*$B$11/12*1.15,2)","v":0},{"$f":"ROUND(-(I3+J3+K3)*$B$11/12*1.15,2)","v":0},{"$f":"-SUM(H3:I3,L3:L3)*$B$11/12*1.15","v":0},{"$f":"SUM(I3,J3,K3,N3,P3)","v":0},{"$f":"SUM(H3,L3,M3,O3)","v":0},{"$f":"IFERROR(U3*('Allocation Detail'!#REF!/'Allocation Detail'!#REF!),0)","v":0},{"$f":"IF($D$39=\"\",0,MAX(-IF($D$41=\"\",0,IF((G3/$D$41)-INT(G3/$D$41)=0,$D$39*((1+$D$42)^INT(G3/12)),0)),-S3))","v":0},{"$f":"IF(OR($D$8=0,$D$39=0,$D$8=\"\",$D$39=\"\"),S3+R3,MAX(R3+S3+U3,0))","v":0},{"$f":"SUM(M3:N3,Q3)/(S3)*-12","v":{"$error":"#DIV/0!"}},null,1,0,{"$f":"D8","v":0},{"$f":"IF(G3/$D$16-INT(G3/$D$16)=0,ROUND($D$14*((1+$D$17)^INT(G3/12)),2),0)","v":0},{"$f":"(AA3+AB3)*$AF$2","v":0},{"$f":"MAX(-IF($D$41=\"\",0,IF((Z3/$D$41)-INT(Z3/$D$41)=0,$D$39*((1+$D$42)^INT(Z3/12)),0)),-SUM(AA3,AB3,AC3))","v":0},{"$f":"MAX(SUM(AA3:AD3),0)","v":0},{"$f":"IF(AE3=0,AA3,0)","v":0},null,1,0,{"$f":"'Allocation Detail'!D13/(1-$B$9*1.15)","v":0},0,{"$f":"SUM(AJ3:AK3)","v":0},{"$f":"D14","v":0},{"$f":"ROUND(AM3*BA$2,2)","v":0},{"$f":"ROUND(AJ3*BA$2,2)","v":0},{"$f":"SUM(AO3:AO3)","v":0},{"$f":"IFERROR(ROUND(-SUM(AJ3,AO3)*'Allocation Detail'!$E$13/12,2),0)","v":0},{"$f":"IFERROR(ROUND(-SUM(AM3,AN3)*'Allocation Detail'!H13/12,2),0)","v":0},0,0,0,{"$f":"SUM(AK3,AM3,AN3,AR3,AT3)","v":0},{"$f":"SUM(AJ3,AO3,AQ3,AS3)","v":0},{"$f":"IFERROR(AY3*('Allocation Detail'!#REF!/'Allocation Detail'!#REF!),0)","v":0},{"$f":"IF($D$39=\"\",0,MAX(-IF($D$41=\"\",0,IF((AI3/$D$41)-INT(AI3/$D$41)=0,$D$39*((1+$D$42)^INT(AI3/12)),0)),-AW3))","v":0},{"$f":"IF(OR($D$8=0,$D$39=0,$D$8=\"\",$D$39=\"\"),AW3+AV3,MAX(AV3+AW3+AY3,0))","v":0},null,1,0,{"$f":"'Allocation Detail'!D13/(1-$B$9*1.15)","v":0},0,{"$f":"SUM(BD3:BE3)","v":0},{"$f":"IF(BC3/$D$16-INT(BC3/$D$16)=0,ROUND($D$14*$D$20*((1+$D$17)^INT(BC3/12)),2),0)","v":0},{"$f":"ROUND(BG3*BU$2,2)","v":0},{"$f":"ROUND(BD3*BU$2,2)","v":0},{"$f":"SUM(BI3:BI3)","v":0},{"$f":"IFERROR(ROUND(-SUM(BD3,BI3)*'Allocation Detail'!E13/12,2),0)","v":0},{"$f":"IFERROR(ROUND(-SUM(BG3,BH3)*'Allocation Detail'!$H$13/12,2),0)","v":0},0,0,{"$f":"-SUM(BD3:BE3,BI3:BI3)*$B$11/12*1.15","v":0},{"$f":"SUM(BE3,BG3,BH3,BL3,BN3)","v":0},{"$f":"SUM(BD3,BI3,BK3,BM3)","v":0},{"$f":"IFERROR(BS3*('Allocation Detail'!#REF!/'Allocation Detail'!#REF!),0)","v":0},{"$f":"IF($D$39=\"\",0,MAX(-IF($D$41=\"\",0,IF((BC3/$D$41)-INT(BC3/$D$41)=0,$D$39*((1+$D$42)^INT(BC3/12)),0)),-BQ3))","v":0},{"$f":"IF(OR($D$8=0,$D$39=0,$D$8=\"\",$D$39=\"\"),BQ3+BP3,MAX(BP3+BQ3+BS3,0))","v":0},null,1,0,{"$f":"'Allocation Detail'!$D$13/(1-$B$9*1.15)","v":0},0,{"$f":"SUM(BX3:BY3)","v":0},{"$f":"IF(BW3/$D$16-INT(BW3/$D$16)=0,ROUND($D$14*$D$20*((1+$D$17)^INT(BW3/12)),2),0)","v":0},{"$f":"ROUND(CA3*CN$2,2)","v":0},{"$f":"ROUND(BX3*CN$2,2)","v":0},{"$f":"IFERROR(ROUND(-SUM(BX3,CC3)*'Allocation Detail'!E13/12,2),0)","v":0},{"$f":"IFERROR(ROUND(-SUM(CA3,CB3)*'Allocation Detail'!H13/12,2),0)","v":0},0,0,{"$f":"-SUM(BX3:BY3,CC3:CC3)*$B$11/12*1.14","v":0},{"$f":"SUM(BY3,CA3,CB3,CE3)","v":0},{"$f":"SUM(BX3,CC3,CD3)","v":0},{"$f":"IFERROR(CL3*('Allocation Detail'!#REF!/'Allocation Detail'!#REF!),0)","v":0},{"$f":"IF($D$39=\"\",0,MAX(-IF($D$41=\"\",0,IF((BW3/$D$41)-INT(BW3/$D$41)=0,$D$39*((1+$D$42)^INT(BW3/12)),0)),-CJ3))","v":0},{"$f":"IF(OR($D$8=0,$D$39=0,$D$8=\"\",$D$39=\"\"),CJ3+CI3,MAX(CI3+CJ3+CL3,0))","v":0},null,1,0,{"$f":"'Allocation Detail'!D13/(1-$B$9*1.15)","v":0},0,{"$f":"SUM(CQ3:CR3)","v":0},{"$f":"IF(CP3/$D$16-INT(CP3/$D$16)=0,ROUND($D$14*$D$20*((1+$D$17)^INT(CP3/12)),2),0)","v":0},{"$f":"ROUND(CT3*DH$2,2)","v":0},{"$f":"ROUND(CQ3*DH$2,2)","v":0},{"$f":"SUM(CV3:CV3)","v":0},{"$f":"IFERROR(ROUND(-SUM(CQ3,CV3)*'Allocation Detail'!$E$13/12,2),0)","v":0},{"$f":"IFERROR(ROUND(-SUM(CT3,CU3)*'Allocation Detail'!$H$13/12,2),0)","v":0},0,0,0,{"$f":"SUM(CR3,CT3,CU3,CY3,DA3)","v":0},{"$f":"SUM(CQ3,CV3,CX3,CZ3)","v":0},{"$f":"IFERROR(DF3*('Allocation Detail'!#REF!/'Allocation Detail'!#REF!),0)","v":0},{"$f":"IF($D$39=\"\",0,MAX(-IF($D$41=\"\",0,IF((CP3/$D$41)-INT(CP3/$D$41)=0,$D$39*((1+$D$42)^INT(CP3/12)),0)),-DD3))","v":0},{"$f":"IF(OR($D$8=0,$D$39=0,$D$8=\"\",$D$39=\"\"),DD3+DC3,MAX(DC3+DD3+DF3,0))","v":0}]
[null,null,null,null,null,{"$f":"F3+1","v":2},{"$f":"G3+1","v":1},{"$f":"ROUND(SUM(H3,L3,M3,O3,T3),2)","v":0},{"$f":"SUM(I3,J3,K3,N3,P3)","v":0},0,{"$f":"ROUND((J4+I4)*((1+$B$45)^(1/12)-1),2)","v":0},0,{"$f":"IFERROR(ROUND(-SUM(H4,L4)*'Allocation Detail'!$E$13/12,2),0)","v":0},{"$f":"IFERROR(ROUND(-SUM(I4,J4,K4)*'Allocation Detail'!$E$13/12,2),0)","v":0},{"$f":"ROUND(-(H4+L4)*$B$11/12*1.15,2)","v":0},{"$f":"ROUND(-(I4+J4+K4)*$B$11/12*1.15,2)","v":0},{"$f":"-SUM(H4:I4,L4:L4)*$B$11/12*1.15","v":0},{"$f":"SUM(I4,J4,K4,N4,P4)","v":0},{"$f":"SUM(H4,L4,M4,O4)","v":0},{"$f":"IFERROR(U4*('Allocation Detail'!#REF!/'Allocation Detail'!#REF!),0)","v":0},0,{"$f":"IF(OR($D$8=0,$D$39=0,$D$8=\"\",$D$39=\"\"),S4+R4,MAX(R3+S4+U4,0))","v":0},{"$f":"SUM(M4:N4,Q4)/(S4)*-12","v":{"$error":"#DIV/0!"}},null,{"$f":"Y3+1","v":2},{"$f":"Z3+1","v":1},{"$f":"AE3","v":0},0,{"$f":"(AA4+AB4)*$AF$2","v":0},0,{"$f":"MAX(SUM(AA4:AD4),0)","v":0},{"$f":"IF(AE4=0,AA4,0)","v":0},null,{"$f":"AH3+1","v":2},{"$f":"AI3+1","v":1},{"$f":"ROUND(SUM(AJ3,AO3,AQ3,AS3,AX3),2)","v":0},{"$f":"SUM(AK3,AM3,AN3,AR3,AT3)","v":0},0,{"$f":"IF(AI4/$D$16-INT(AI4/$D$16)=0,ROUND($D$14*$D$20*((1+$D$17)^INT(AI4/12)),2),0)","v":0},{"$f":"ROUND((AM4+AK4)*BA$2,2)","v":0},0,0,{"$f":"IFERROR(ROUND(-SUM(AJ4,AO4)*'Allocation Detail'!$E$13/12,2),0)","v":0},{"$f":"IFERROR(ROUND(-SUM(AK4,AM4,AN4)*'Allocation Detail'!$H$13/12,2),0)","v":0},0,0,0,{"$f":"SUM(AK4,AM4,AN4,AR4,AT4)","v":0},{"$f":"SUM(AJ4,AO4,AQ4,AS4)","v":0},{"$f":"IFERROR(AY4*('Allocation Detail'!#REF!/'Allocation Detail'!#REF!),0)","v":0},0,{"$f":"IF(OR($D$8=0,$D$39=0,$D$8=\"\",$D$39=\"\"),AW4+AV4,MAX(AV3+AW4+AY4,0))","v":0},null,{"$f":"BB3+1","v":2},{"$f":"BC3+1","v":1},{"$f":"ROUND(SUM(BD3,BI3,BK3,BM3,BR3),2)","v":0},{"$f":"SUM(BE3,BG3,BH3,BL3,BN3)","v":0},0,0,{"$f":"ROUND((BE4+BG4)*BU$2,2)","v":0},{"$f":"ROUND(BD4*BU$2,2)","v":0},0,{"$f":"IFERROR(ROUND(-SUM(BD4,BI4)*'Allocation Detail'!$E$13/12,2),0)","v":0},{"$f":"IFERROR(ROUND(-SUM(BE4,BG4,BH4)*'Allocation Detail'!$H$13/12,2),0)","v":0},0,0,{"$f":"-SUM(BD4:BE4,BI4)*$B$11/12*1.15","v":0},{"$f":"SUM(BE4,BG4,BH4,BL4,BN4)","v":0},{"$f":"SUM(BD4,BI4,BK4,BM4)","v":0},{"$f":"IFERROR(BS4*('Allocation Detail'!#REF!/'Allocation Detail'!#REF!),0)","v":0},0,0,null,{"$f":"BV3+1","v":2},{"$f":"BW3+1","v":1},{"$f":"ROUND(SUM(BX3,CC3,CD3,CF3,CK3),2)","v":0},{"$f":"SUM(BY3,CA3,CB3,CE3,CG3)","v":0},0,0,{"$f":"ROUND((CA4+BY4)*CN$2,2)","v":0},0,{"$f":"IFERROR(ROUND(-SUM(BX4,CC4)*'Allocation Detail'!$E$13/12,2),0)","v":0},{"$f":"IFERROR(ROUND(-SUM(BY4,CA4,CB4)*'Allocation Detail'!$H$13/12,2),0)","v":0},0,0,{"$f":"-SUM(BX4:BY4,CC4)*$B$11/12*1.14","v":0},{"$f":"SUM(BY4,CA4,CB4,CE4)","v":0},{"$f":"SUM(BX4,CC4,CD4)","v":0},{"$f":"IFERROR(CL4*('Allocation Detail'!#REF!/'Allocation Detail'!#REF!),0)","v":0},0,0,null,{"$f":"CO3+1","v":2},{"$f":"CP3+1","v":1},{"$f":"ROUND(SUM(CQ3,CV3,CX3,CZ3,DE3),2)","v":0},{"$f":"SUM(CR3,CT3,CU3,CY3,DA3)","v":0},0,0,{"$f":"ROUND((CT4+CR4)*DH$2,2)","v":0},0,0,{"$f":"IFERROR(ROUND(-SUM(CQ4,CV4)*'Allocation Detail'!$E$13/12,2),0)","v":0},{"$f":"IFERROR(ROUND(-SUM(CR4,CT4,CU4)*'Allocation Detail'!$H$13/12,2),0)","v":0},0,0,0,{"$f":"SUM(CR4,CT4,CU4,CY4,DA4)","v":0},{"$f":"SUM(CQ4,CV4,CX4,CZ4)","v":0},{"$f":"IFERROR(DF4*('Allocation Detail'!#REF!/'Allocation Detail'!#REF!),0)","v":0},0,0]
[null,null,null,null,null,{"$f":"F4+1","v":3},{"$f":"G4+1","v":2},0,0,0,0,0,{"$f":"IFERROR(ROUND(-SUM(H5,L5)*'Allocation Detail'!$E$13/12,2),0)","v":0},{"$f":"IFERROR(ROUND(-SUM(I5,J5,K5)*'Allocation Detail'!$E$13/12,2),0)","v":0},{"$f":"ROUND(-(H5+L5)*$B$11/12*1.15,2)","v":0},{"$f":"ROUND(-(I5+J5+K5)*$B$11/12*1.15,2)","v":0},{"$f":"-SUM(H5:I5,L5:L5)*$B$11/12*1.15","v":0},0,0,{"$f":"IFERROR(U5*('Allocation Detail'!#REF!/'Allocation Detail'!#REF!),0)","v":0},0,0,{"$error":"#DIV/0!"},null,{"$f":"Y4+1","v":3},2,{"$f":"AE4","v":0},0,0,0,0,0,null,{"$f":"AH4+1","v":3},2,0,0,0,0,0,0,0,{"$f":"IFERROR(ROUND(-SUM(AJ5,AO5)*'Allocation Detail'!$E$13/12,2),0)","v":0},{"$f":"IFERROR(ROUND(-SUM(AK5,AM5,AN5)*'Allocation Detail'!$H$13/12,2),0)","v":0},0,0,0,0,0,{"$f":"IFERROR(AY5*('Allocation Detail'!#REF!/'Allocation Detail'!#REF!),0)","v":0},0,0,null,{"$f":"BB4+1","v":3},2,0,0,0,0,{"$f":"ROUND((BE5+BG5)*BU$2,2)","v":0},0,0,{"$f":"IFERROR(ROUND(-SUM(BD5,BI5)*'Allocation Detail'!$E$13/12,2),0)","v":0},{"$f":"IFERROR(ROUND(-SUM(BE5,BG5,BH5)*'Allocation Detail'!$H$13/12,2),0)","v":0},0,0,{"$f":"-SUM(BD5:BE5,BI5)*$B$11/12*1.15","v":0},0,0,{"$f":"IFERROR(BS5*('Allocation Detail'!#REF!/'Allocation Detail'!#REF!),0)","v":0},0,0,null,{"$f":"BV4+1","v":3},2,0,0,0,0,0,0,{"$f":"IFERROR(ROUND(-SUM(BX5,CC5)*'Allocation Detail'!$E$13/12,2),0)","v":0},{"$f":"IFERROR(ROUND(-SUM(BY5,CA5,CB5)*'Allocation Detail'!$H$13/12,2),0)","v":0},0,0,0,{"$f":"SUM(BY5,CA5,CB5,CE5)","v":0},{"$f":"SUM(BX5,CC5,CD5)","v":0},{"$f":"IFERROR(CL5*('Allocation Detail'!#REF!/'Allocation Detail'!#REF!),0)","v":0},0,0,null,{"$f":"CO4+1","v":3},2,0,0,0,0,0,0,0,{"$f":"IFERROR(ROUND(-SUM(CQ5,CV5)*'Allocation Detail'!$E$13/12,2),0)","v":0},{"$f":"IFERROR(ROUND(-SUM(CR5,CT5,CU5)*'Allocation Detail'!$H$13/12,2),0)","v":0},0,0,0,0,0,{"$f":"IFERROR(DF5*('Allocation Detail'!#REF!/'Allocation Detail'!#REF!),0)","v":0},0,0]
[null,null,null,null,null,4,3,0,0,0,0,0,{"$f":"IFERROR(ROUND(-SUM(H6,L6)*'Allocation Detail'!$E$13/12,2),0)","v":0},{"$f":"IFERROR(ROUND(-SUM(I6,J6,K6)*'Allocation Detail'!$E$13/12,2),0)","v":0},0,0,0,0,0,{"$f":"IFERROR(U6*('Allocation Detail'!#REF!/'Allocation Detail'!#REF!),0)","v":0},0,0,{"$error":"#DIV/0!"},null,4,3,0,0,0,0,0,0,null,4,3,0,0,0,0,0,0,0,{"$f":"IFERROR(ROUND(-SUM(AJ6,AO6)*'Allocation Detail'!$E$13/12,2),0)","v":0},{"$f":"IFERROR(ROUND(-SUM(AK6,AM6,AN6)*'Allocation Detail'!$H$13/12,2),0)","v":0},0,0,0,0,0,{"$f":"IFERROR(AY6*('Allocation Detail'!#REF!/'Allocation Detail'!#REF!),0)","v":0},0,0,null,{"$f":"BB5+1","v":4},3,0,0,0,0,0,0,0,{"$f":"IFERROR(ROUND(-SUM(BD6,BI6)*'Allocation Detail'!$E$13/12,2),0)","v":0},{"$f":"IFERROR(ROUND(-SUM(BE6,BG6,BH6)*'Allocation Detail'!$H$13/12,2),0)","v":0},0,0,0,0,0,{"$f":"IFERROR(BS6*('Allocation Detail'!#REF!/'Allocation Detail'!#REF!),0)","v":0},0,0,null,4,3,0,0,0,0,0,0,{"$f":"IFERROR(ROUND(-SUM(BX6,CC6)*'Allocation Detail'!$E$13/12,2),0)","v":0},{"$f":"IFERROR(ROUND(-SUM(BY6,CA6,CB6)*'Allocation Detail'!$H$13/12,2),0)","v":0},0,0,0,0,0,{"$f":"IFERROR(CL6*('Allocation Detail'!#REF!/'Allocation Detail'!#REF!),0)","v":0},0,0,null,4,3,0,0,0,0,0,0,0,{"$f":"IFERROR(ROUND(-SUM(CQ6,CV6)*'Allocation Detail'!$E$13/12,2),0)","v":0},{"$f":"IFERROR(ROUND(-SUM(CR6,CT6,CU6)*'Allocation Detail'!$H$13/12,2),0)","v":0},0,0,0,0,0,{"$f":"IFERROR(DF6*('Allocation Detail'!#REF!/'Allocation Detail'!#REF!),0)","v":0},0,0]
{"$rows_left_out":122}
{"sheet":"Lists","index":2,"n_rows":122,"n_cols":6,"rows_kept":122,"cut":false,"hidden":true,"merged":[[10,2,10,4]]}
["Product name",null,null,null,"Dropdown"]
["Select:",null,null,null,"Select:"]
["Ashburton Ashmore","Ashburton Fund Managers",null,null,{"$f":"IF(HLOOKUP('Ashburton EAC'!$C$2,Lists!$A$3:$C$10,F3,FALSE)=0,\"\",HLOOKUP('Ashburton EAC'!$C$2,Lists!$A$3:$C$10,F3,FALSE))","v":"N/A"},2]
["Ashburton Investment Account","N/A",null,null,{"$f":"IF(HLOOKUP('Ashburton EAC'!$C$2,Lists!$A$3:$C$10,F4,FALSE)=0,\"\",HLOOKUP('Ashburton EAC'!$C$2,Lists!$A$3:$C$10,F4,FALSE))","v":""},{"$f":"F3+1","v":3}]
["Ashburton Tax Free Savings Account",null,null,null,{"$f":"IF(HLOOKUP('Ashburton EAC'!$C$2,Lists!$A$3:$C$10,F5,FALSE)=0,\"\",HLOOKUP('Ashburton EAC'!$C$2,Lists!$A$3:$C$10,F5,FALSE))","v":""},{"$f":"F4+1","v":4}]
["Ashburton Retirement Annuity",null,null,null,{"$f":"IF(HLOOKUP('Ashburton EAC'!$C$2,Lists!$A$3:$C$10,F6,FALSE)=0,\"\",HLOOKUP('Ashburton EAC'!$C$2,Lists!$A$3:$C$10,F6,FALSE))","v":""},5]
{"$rows_left_out":117}
{"sheet":"Instruments","index":3,"n_rows":13,"n_cols":8,"rows_kept":13,"cut":false,"hidden":true,"merged":[]}
["TFSA","FUND NAME","ASISA Classification","Fund Code","TIC","Performance Fee","Min fee","Max fee"]
["NO","Ashburton  Equity Fund ",null,"ASEA1",1.15E-2]
["Yes","Ashburton SA Income Fund ",null,"ASIB1",7.4749999999999999E-3]
["Yes","Ashburton Targeted Return Fund ",null,"ASTRB4",9.1999999999999998E-3]
["Yes","Ashburton Balanced Fund ",null,"ABFA1",1.15E-2]
["Yes","Ashburton Money Market Fund ",null,"ASMMB1",3.4499999999999999E-3]
{"$rows_left_out":8}
{"sheet":"Allocation Detail","index":4,"n_rows":13,"n_cols":8,"rows_kept":13,"cut":false,"hidden":true,"merged":[[0,0,0,7]]}
["Ashburton (Internal & Single Managed Models) Unit Trust Allocation"]
["Instrument Name","TIC (Incl VAT)","Lump sum %","Lump sum amt","WAF","Recurring %","Recurring amt","WAF"]
[{"$f":"'Ashburton EAC'!A23","v":0},{"$f":"IFERROR(VLOOKUP(A3,Instruments!$B$2:$E$13,4,FALSE),0)","v":0},{"$f":"IF(A3=\"\",\"\",IFERROR(VLOOKUP(A3,Calculations!$A$25:$C$35,3,FALSE),0))","v":0},{"$f":"IFERROR(C3*Calculations!$D$10,\"\")","v":0},{"$f":"C3*B3","v":0},{"$f":"IF(A3=\"\",0,IFERROR(VLOOKUP(A3,Calculations!$A$25:$D$35,4,FALSE),0))","v":0},{"$f":"IFERROR(F3*Calculations!$D$19,\"\")","v":0},{"$f":"IF(OR(A3=\"\",F3=0),0,B3*(G3/$G$13))","v":0}]
[{"$f":"'Ashburton EAC'!A24","v":0},{"$f":"IFERROR(VLOOKUP(A4,Instruments!$B$2:$E$13,4,FALSE),0)","v":0},{"$f":"IF(A4=\"\",\"\",IFERROR(VLOOKUP(A4,Calculations!$A$25:$C$35,3,FALSE),0))","v":0},{"$f":"IFERROR(C4*Calculations!$D$10,\"\")","v":0},{"$f":"C4*B4","v":0},{"$f":"IF(A4=\"\",0,IFERROR(VLOOKUP(A4,Calculations!$A$25:$D$35,4,FALSE),0))","v":0},{"$f":"IFERROR(F4*Calculations!$D$19,\"\")","v":0},{"$f":"IF(OR(A4=\"\",F4=0),0,B4*(G4/$G$13))","v":0}]
[{"$f":"'Ashburton EAC'!A25","v":0},{"$f":"IFERROR(VLOOKUP(A5,Instruments!$B$2:$E$13,4,FALSE),0)","v":0},{"$f":"IF(A5=\"\",\"\",IFERROR(VLOOKUP(A5,Calculations!$A$25:$C$35,3,FALSE),0))","v":0},{"$f":"IFERROR(C5*Calculations!$D$10,\"\")","v":0},0,{"$f":"IF(A5=\"\",0,IFERROR(VLOOKUP(A5,Calculations!$A$25:$D$35,4,FALSE),0))","v":0},{"$f":"IFERROR(F5*Calculations!$D$19,\"\")","v":0},0]
[{"$f":"'Ashburton EAC'!A26","v":0},{"$f":"IFERROR(VLOOKUP(A6,Instruments!$B$2:$E$13,4,FALSE),0)","v":0},{"$f":"IF(A6=\"\",\"\",IFERROR(VLOOKUP(A6,Calculations!$A$25:$C$35,3,FALSE),0))","v":0},{"$f":"IFERROR(C6*Calculations!$D$10,\"\")","v":0},0,{"$f":"IF(A6=\"\",0,IFERROR(VLOOKUP(A6,Calculations!$A$25:$D$35,4,FALSE),0))","v":0},{"$f":"IFERROR(F6*Calculations!$D$19,\"\")","v":0},0]
{"$rows_left_out":7}